{"text_format":"1","workbook":"xlsx","n_sheets":25,"sheets":["Title_Sheet","Hub","Dashboard","3_Main_Models --->","DCF","LBO","Merger","LBO_Extras --->","DCF_Synergies","Main_Components --->","Operating_Model","WACC_Calculator","D&A+CAPEX","Net_Working_Capital","Scenario_Analysis--->","SC_Manager","Time_Series","Buildups--->","Revenue_Build","Tester","Historicals","Debt_Schedule","Comps--->","Comp_Overview","XLinkMeta"],"not_rendered":{"charts":3,"images":0,"macros":1,"external_links":0,"defined_names":10,"comments":1,"pivot_tables":0},"unopened":[],"bounds":{"document_bytes":16777216,"sheet_cells":100000,"rows_first":2000,"rows_last":500,"rows_between":2000,"halvings":0,"cell_chars":16384,"cell_head_chars":4096},"cells_cut":0,"cells_raw":0,"read":"whole","date_system":"1900"}

{"sheet":"Title_Sheet","index":0,"n_rows":10,"n_cols":5,"rows_kept":10,"cut":false,"hidden":false,"merged":[]}
[]
[]
[null,null,"DCF, LBO and M&A model"]
[]
[null,null,"All rights Reserved by Valentino Magniette-Bosseboeuf"]
[null,null,"© 2024"]
{"$rows_left_out":5}
{"sheet":"Hub","index":1,"n_rows":89,"n_cols":22,"rows_kept":89,"cut":false,"hidden":false,"merged":[]}
[]
[null,null,"Main Information",null,null,null,null,null,null,null,null,null,null,null,null,null,null,null,"Stock Information Override"]
[]
[null,"Bloomberg Ticker",null,"CZR US EQUITY",null,null,null,null,null,"Use Bloomberg stock information tool?",null,null,null,"Yes",null,null,null,{"$f":"IF(N4=\"Yes\",\"Override Disabled\",\"Override Enabled\")","v":"Override Disabled"}]
[]
[null,"Official Name",null,{"$f":"_xll.BDP(D4, \"DS002\")","v":"CAESARS ENTERTAINMENT INC"},null,"Share Price",null,{"$f":"_xll.BDP($D$4, \"PX_ASK\")","v":36.869999999999997},null,null,null,null,null,null,null,"Official Name",null,null,null,"Share Price"]
{"$rows_left_out":84}
{"sheet":"Dashboard","index":2,"n_rows":9,"n_cols":12,"rows_kept":9,"cut":false,"hidden":false,"merged":[]}
[]
[null,{"$f":"DCF!C2","v":"CAESARS ENTERTAINMENT INC"}]
[null,"Dashboard",null,null,null,"Enable Master Override?",null,null,"No"]
[null,{"$f":"IF(OR(Hub!R14:R16<>\"Ok\", Hub!V14:V16<>\"Ok\"), \"Model Not Complete\", \"Model Completed\")","v":"Model Not Complete"}]
[]
[null,"WACC",null,null,null,null,"Risk Free Rate",null,null,null,null,"Revenue Synergy Increase"]
{"$rows_left_out":4}
{"sheet":"3_Main_Models --->","index":3,"n_rows":0,"n_cols":0,"rows_kept":0,"cut":false,"hidden":false,"merged":[]}

{"sheet":"DCF","index":4,"n_rows":74,"n_cols":27,"rows_kept":74,"cut":false,"hidden":false,"merged":[]}
[]
[null,null,{"$f":"IF(Hub!N4=\"No\", Hub!R6, Hub!D6)","v":"CAESARS ENTERTAINMENT INC"},"Discounted Cash Flow Analysis"]
[null,null,{"$f":"\"All Figures in \" & Hub!D8 &\" Millions, expect for per share data\"","v":"All Figures in USD Millions, expect for per share data"}]
[null,null,"Fiscal Year Ending December 31",null,null,null,null,{"$f":"IF(Dashboard!I3=\"Yes\", \"Dashboard Master Override Enabled\", \"Dashboard Master Override Disabled\")","v":"Dashboard Master Override Disabled"}]
[]
[]
{"$rows_left_out":69}
{"sheet":"LBO","index":5,"n_rows":62,"n_cols":14,"rows_kept":62,"cut":false,"hidden":false,"merged":[]}
[]
[null,{"$f":"DCF!C2","v":"CAESARS ENTERTAINMENT INC"},"Leverage Buyout Model"]
[null,{"$f":"DCF!C3","v":"All Figures in USD Millions, expect for per share data"}]
[null,"Fiscal Year Ending December 31"]
[]
[null,null,null,null,null,null,null,"Transaction Assumptions"]
{"$rows_left_out":57}
{"sheet":"Merger","index":6,"n_rows":105,"n_cols":40,"rows_kept":105,"cut":false,"hidden":false,"merged":[]}
[]
[null,"General Information"]
[null,"Acquirer Name",null,null,null,{"$f":"Hub!T42","v":"GENERAL ELECTRIC CO"}]
[]
[null,{"$f":"TEXT(F3,) &\" - Current Share Price\"","v":"GENERAL ELECTRIC CO - Current Share Price"},null,null,null,{"$f":"Hub!T45","v":159.19}]
[null,{"$f":"DCF!C2 &\" - Current Share Price\"","v":"CAESARS ENTERTAINMENT INC - Current Share Price"},null,null,null,{"$f":"DCF!N11","v":36.869999999999997}]
{"$rows_left_out":100}
{"sheet":"LBO_Extras --->","index":7,"n_rows":0,"n_cols":0,"rows_kept":0,"cut":false,"hidden":false,"merged":[]}

{"sheet":"DCF_Synergies","index":8,"n_rows":75,"n_cols":25,"rows_kept":75,"cut":false,"hidden":false,"merged":[]}
[]
[null,{"$f":"IF(Hub!N4=\"No\", Hub!R6, Hub!D6)","v":"CAESARS ENTERTAINMENT INC"},"Discounted Cash Flow Analysis (With Synergies)"]
[null,{"$f":"DCF!C3","v":"All Figures in USD Millions, expect for per share data"}]
[null,"Fiscal Year Ending December 31",null,null,null,null,{"$f":"IF(Dashboard!I3=\"Yes\", \"Dashboard Master Override Enabled\", \"Dashboard Master Override Disabled\")","v":"Dashboard Master Override Disabled"}]
[]
[]
{"$rows_left_out":70}
{"sheet":"Main_Components --->","index":9,"n_rows":0,"n_cols":0,"rows_kept":0,"cut":false,"hidden":false,"merged":[]}

{"sheet":"Operating_Model","index":10,"n_rows":172,"n_cols":21,"rows_kept":172,"cut":false,"hidden":false,"merged":[]}
[]
[null,null,{"$f":"DCF!C2","v":"CAESARS ENTERTAINMENT INC"},"Operating Model"]
[null,null,{"$f":"DCF!C3","v":"All Figures in USD Millions, expect for per share data"}]
[null,null,"Fiscal Year Ending December 31"]
[]
[null,null,null,null,null,null,"Actuals",null,null,null,null,null,null,"Forecast"]
{"$rows_left_out":167}
{"sheet":"WACC_Calculator","index":11,"n_rows":9,"n_cols":12,"rows_kept":9,"cut":false,"hidden":false,"merged":[]}
[]
[null,{"$f":"DCF!C2","v":"CAESARS ENTERTAINMENT INC"},"WACC Calculator"]
[]
[null,null,"Calc WACC",{"$f":"((G4/G6*G7))+((G5/G6)*G8*(1-L4))","v":8.0848911765504614E-2},null,"Market Cap",{"$f":"IF(Hub!N4=\"Yes\", _xll.BDP(Hub!D4, \"RR902\")/1000000, Hub!V6*Hub!V7)","v":7977.07665696},null,"Tax Rate",null,null,{"$f":"DCF!D11","v":0.21}]
[null,null,null,null,null,"Market Value of Debt",{"$f":"IF(Debt_Schedule!AC28=\"Backup Schedule Enabled\", Debt_Schedule!AD41, Debt_Schedule!J105+Debt_Schedule!T105)","v":25711},null,"Beta",null,null,{"$f":"IF(Hub!N4=\"Yes\", _xll.BDP(Hub!D4, \"RK001\"), Hub!V8)","v":1.9817972183227539}]
[null,null,null,null,null,"Cost of Capital",{"$f":"G4+G5","v":33688.076656960002},null,"Risk Free Rate",null,null,{"$f":"DCF!N12","v":4.1673549999999997E-2}]
{"$rows_left_out":4}
{"sheet":"D&A+CAPEX","index":12,"n_rows":63,"n_cols":19,"rows_kept":63,"cut":false,"hidden":false,"merged":[]}
[]
[null,null,null,null,null,null,"Actuals",null,null,null,null,null,null,"Forecast"]
[null,null,null,null,{"$f":"YEAR(E4)","v":2019},{"$f":"YEAR(F4)","v":2020},2021,2022,2023,{"$f":"YEAR(J4)","v":2024},{"$f":"YEAR(K4)","v":2025},2026,2027,2028,2029,2030,2031,2032,2033]
[null,null,null,null,{"$f":"EOMONTH(F4,-12)","v":"2019-12-31"},"2020-12-31","2021-12-31",{"$f":"EOMONTH(I4,-12)","v":"2022-12-31"},{"$f":"DCF!I16","v":"2023-12-31"},{"$f":"EOMONTH(I4,12)","v":"2024-12-31"},{"$f":"EOMONTH(J4,12)","v":"2025-12-31"},"2026-12-31","2027-12-31","2028-12-31","2029-12-31","2030-12-31","2031-12-31","2032-12-31","2033-12-31"]
[null,null,null,null,"-4FY","-3FY","-2FY","-1FY","-0FY"]
[]
{"$rows_left_out":58}
{"sheet":"Net_Working_Capital","index":13,"n_rows":24,"n_cols":19,"rows_kept":24,"cut":false,"hidden":false,"merged":[]}
[]
[null,null,null,null,null,null,"Actuals",null,null,null,null,null,null,"Forecast"]
[null,null,null,{"$f":"YEAR(D4)","v":2018},{"$f":"YEAR(E4)","v":2019},{"$f":"YEAR(F4)","v":2020},2021,2022,2023,{"$f":"YEAR(J4)","v":2024},{"$f":"YEAR(K4)","v":2025},2026,2027,2028,2029,2030,2031,2032,2033]
[null,null,null,{"$f":"EOMONTH(E4,-12)","v":"2018-12-31"},"2019-12-31","2020-12-31","2021-12-31",{"$f":"EOMONTH(I4,-12)","v":"2022-12-31"},{"$f":"DCF!D10","v":"2023-12-31"},{"$f":"EOMONTH(I4,12)","v":"2024-12-31"},{"$f":"EOMONTH(J4,12)","v":"2025-12-31"},"2026-12-31","2027-12-31","2028-12-31",{"$f":"EOMONTH(N4,12)","v":"2029-12-31"},{"$f":"EOMONTH(O4,12)","v":"2030-12-31"},{"$f":"EOMONTH(P4,12)","v":"2031-12-31"},{"$f":"EOMONTH(Q4,12)","v":"2032-12-31"},{"$f":"EOMONTH(R4,12)","v":"2033-12-31"}]
[null,null,null,"-5FY","-4FY","-3FY","-2FY","-1FY","-0FY"]
[null,null,"Change in Net Working Capital"]
{"$rows_left_out":19}
{"sheet":"Scenario_Analysis--->","index":14,"n_rows":0,"n_cols":0,"rows_kept":0,"cut":false,"hidden":false,"merged":[]}

{"sheet":"SC_Manager","index":15,"n_rows":63,"n_cols":18,"rows_kept":63,"cut":false,"hidden":false,"merged":[]}
[]
[null,null,null,{"$f":"DCF!C2","v":"CAESARS ENTERTAINMENT INC"},null,null,null," "," "," "," "," "," "," "," "," "," "," "]
[null,null,null,"Scenario Manager",null,null," "," "," "," "," "," "," "," "," "," "," "," "]
[null,null,null,null,null,null," "," "," "," "," "," "," "," "," "," "," "," "]
[]
[null,null,null,"Scenario Chooser",null,null," "," "," "," "," "," "," "," "," "," "," "," "]
{"$rows_left_out":58}
{"sheet":"Time_Series","index":16,"n_rows":87,"n_cols":17,"rows_kept":87,"cut":false,"hidden":false,"merged":[]}
[]
[null,{"$f":"DCF!C2","v":"CAESARS ENTERTAINMENT INC"},null,null," "," "," "," "," "," "]
[null,"Time Series",null,null," "," "," "," "," "," "]
[null,null,null,null," "," "," "," "," "," "]
[]
[null,"Operating Assumptions",null,null," "," "," "," "," "," "]
{"$rows_left_out":82}
{"sheet":"Buildups--->","index":17,"n_rows":0,"n_cols":0,"rows_kept":0,"cut":false,"hidden":false,"merged":[]}

{"sheet":"Revenue_Build","index":18,"n_rows":100,"n_cols":21,"rows_kept":100,"cut":false,"hidden":false,"merged":[[1,3,1,7],[2,2,3,2],[1,8,1,17]]}
[]
[null,null,{"$f":"\"In Millions of \" & Hub!D8","v":"In Millions of USD"},"Actuals",null,null,null,null,"Forecast"]
[null,null,"Revenue Segments",{"$f":"YEAR(D4)","v":2019},2020,2021,2022,2023,2024,2025,2026,2027,2028,2029,2030,2031,2032,2033]
[null,null,null,{"$f":"EOMONTH(E4, -12)","v":"2019-12-31"},{"$f":"EOMONTH(F4, -12)","v":"2020-12-31"},{"$f":"EOMONTH(G4, -12)","v":"2021-12-31"},{"$f":"EOMONTH(H4, -12)","v":"2022-12-31"},{"$f":"DCF!D10","v":"2023-12-31"},{"$f":"EOMONTH(H4,12)","v":"2024-12-31"},"2025-12-31","2026-12-31","2027-12-31","2028-12-31","2029-12-31","2030-12-31","2031-12-31","2032-12-31","2033-12-31"]
[]
[null,1,{"$f":"IF(ISBLANK(Hub!D13), IFERROR(IF(INDEX(C$41:C$100, SMALL(IF($B$41:$B$100=1, ROW($B$41:$B$100)-ROW($B$41)+1), $B6))=\"#N/A N/A\", \"Division \" & $B6 & \" Revenue\", INDEX(C$41:C$100, SMALL(IF($B$41:$B$100=1, ROW($B$41:$B$100)-ROW($B$41)+1), $B6))), \"Division \" & B6 & \" Revenue\"), Hub!D13 & \" Revenue\")","v":"Casino & Pari-Mutuel Commissions"},{"$f":"IFERROR(IF(INDEX(I$41:I$100, SMALL(IF($B$41:$B$100=1, ROW($B$41:$B$100)-ROW($B$41)+1), $B6))=\"#N/A N/A\", 0, INDEX(I$41:I$100, SMALL(IF($B$41:$B$100=1, ROW($B$41:$B$100)-ROW($B$41)+1), $B6))), 0)","v":1808},{"$f":"IFERROR(IF(INDEX(H$41:H$100, SMALL(IF($B$41:$B$100=1, ROW($B$41:$B$100)-ROW($B$41)+1), $B6))=\"#N/A N/A\", 0, INDEX(H$41:H$100, SMALL(IF($B$41:$B$100=1, ROW($B$41:$B$100)-ROW($B$41)+1), $B6))), 0)","v":2482},{"$f":"IFERROR(IF(INDEX(G$41:G$100, SMALL(IF($B$41:$B$100=1, ROW($B$41:$B$100)-ROW($B$41)+1), $B6))=\"#N/A N/A\", 0, INDEX(G$41:G$100, SMALL(IF($B$41:$B$100=1, ROW($B$41:$B$100)-ROW($B$41)+1), $B6))), 0)","v":5827},{"$f":"IFERROR(IF(INDEX(F$41:F$100, SMALL(IF($B$41:$B$100=1, ROW($B$41:$B$100)-ROW($B$41)+1), $B6))=\"#N/A N/A\", 0, INDEX(F$41:F$100, SMALL(IF($B$41:$B$100=1, ROW($B$41:$B$100)-ROW($B$41)+1), $B6))), 0)","v":5997},{"$f":"IFERROR(IF(INDEX(E$41:E$100, SMALL(IF($B$41:$B$100=1, ROW($B$41:$B$100)-ROW($B$41)+1), $B6))=\"#N/A N/A\", 0, INDEX(E$41:E$100, SMALL(IF($B$41:$B$100=1, ROW($B$41:$B$100)-ROW($B$41)+1), $B6))), 0)","v":6367},{"$f":"IF(SUM(D6:H6)=0, 0, Time_Series!F11)","v":8189.9666748176778},{"$f":"IF(SUM(E6:I6)=0, 0, Time_Series!G11)","v":10534.875786810762},{"$f":"IF(SUM(F6:J6)=0, 0, Time_Series!H11)","v":13551.167208626324},{"$f":"IF(SUM(G6:K6)=0, 0, Time_Series!I11)","v":17431.067668216067},{"$f":"IF(SUM(H6:L6)=0, 0, Time_Series!J11)","v":22421.841261061956},{"$f":"IF(SUM(I6:M6)=0, 0, Time_Series!K11)","v":28841.547466020009},{"$f":"IF(SUM(J6:N6)=0, 0, Time_Series!L11)","v":37099.310915168229},{"$f":"IF(SUM(K6:O6)=0, 0, Time_Series!M11)","v":47721.39469984726},{"$f":"IF(SUM(L6:P6)=0, 0, Time_Series!N11)","v":61384.738851510912},{"$f":"IF(SUM(M6:Q6)=0, 0, Time_Series!O11)","v":78960.101387821633}]
{"$rows_left_out":95}
{"sheet":"Tester","index":19,"n_rows":25,"n_cols":29,"rows_kept":25,"cut":false,"hidden":false,"merged":[]}
[]
[]
[]
[]
[]
[]
{"$rows_left_out":20}
{"sheet":"Historicals","index":20,"n_rows":47,"n_cols":18,"rows_kept":47,"cut":false,"hidden":false,"merged":[]}
[]
[null,{"$f":"DCF!C2","v":"CAESARS ENTERTAINMENT INC"}]
[null,"Historicals"]
[null,{"$f":"DCF!C3","v":"All Figures in USD Millions, expect for per share data"}]
[null,"As % of Revenue"]
[]
{"$rows_left_out":42}
{"sheet":"Debt_Schedule","index":21,"n_rows":105,"n_cols":45,"rows_kept":105,"cut":false,"hidden":false,"merged":[]}
[]
[null,"Bond Names","Year Due","Yearly Coupon Rate","Currency","Principal Outstanding","Principal Issued","Adjusted Principal Outstanding",null,"Outstanding Market Value",null,null,null,null,"Year Due","Interest Rate","Estimated Interest Rate?","Amount left",null,"Market Value",null,null,null,null,null,null,null,"Actuals",null,null,null,null,"Forecast",null,null,null,null,null,null,null,null,null,"IR","Amount","Years"]
[null,{"$f":"_xll.BQL(\"bonds('\" & Hub!D4 & \"')\", \"id\", \"showids\", \"false\",\"cols=1;rows=5\")","v":"id"},null,null,null,null,null,null,null,null,null,null,null,null,null,null,null,null,null,null,null,null,null,null,{"$f":"YEAR(Y4)","v":2018},{"$f":"YEAR(Z4)","v":2019},{"$f":"YEAR(AA4)","v":2020},2021,2022,{"$f":"YEAR(AD4)","v":2023},{"$f":"YEAR(AE4)","v":2024},{"$f":"YEAR(AF4)","v":2025},2026,2027,2028,2029,2030,2031,2032,2033,null,"Cash From Debt"]
[null,"BR401813 Corp",{"$f":"IFERROR(YEAR(_xll.BDP(B4,\"DS035\")), 0)","v":2029},{"$f":"IFERROR(_xll.BDP(B4,\"DS033\")/100, 0)","v":4.6249999999999999E-2},{"$f":"IFERROR(_xll.BDP(B4,\"DS004\"), 0)","v":"USD"},{"$f":"IFERROR(_xll.BDP(B4,\"DS021\")/1000000, 0)","v":1200},{"$f":"IFERROR(_xll.BDP(B4,\"DS218\")/1000000, 0)","v":1200},{"$f":"IFERROR(IF(E4=Hub!$D$8,F4, F4*((_xll.BDP(E4 & Hub!$D$8 & \" Curncy\", \"PR005\")/_xll.BDP(E4 & Hub!$D$8 & \" Curncy\", \"DS672\")))),0)","v":1200},null,{"$f":"IFERROR(IF(C4=0,0,-PV(DCF!$D$12, C4-YEAR(DCF!$D$10), H4*D4, H4, 0)),\"\")","v":1362.7932233294703},null,"BS_LT_BORROW",null,"Other Debts",2033,{"$f":"IF(F105=0, (_xll.BDP(Hub!D4,\"VM010\")/100)/(1-Hub!H10), SUMPRODUCT(D4:D103,F4:F103)/SUM(F4:F103))","v":6.7167218120147087E-2},"Yes",{"$f":"_xll.BDP(Hub!D4, L4, \"EQY_FUND_CRNCY\", Hub!D8)-H105","v":19400.101999999999},null,{"$f":"IFERROR(-PV(DCF!$D$12, O4-YEAR(DCF!$D$10), R4*P4, R4, 0), \"\")","v":27215.49180623523},null,null,null,null,{"$f":"EOMONTH(Z4,-12)","v":"2018-12-31"},{"$f":"EOMONTH(AA4,-12)","v":"2019-12-31"},{"$f":"EOMONTH(AB4,-12)","v":"2020-12-31"},{"$f":"EOMONTH(AC4,-12)","v":"2021-12-31"},{"$f":"EOMONTH(AD4,-12)","v":"2022-12-31"},{"$f":"DCF!I16","v":"2023-12-31"},{"$f":"EOMONTH(AD4,12)","v":"2024-12-31"},{"$f":"EOMONTH(AE4,12)","v":"2025-12-31"},{"$f":"EOMONTH(AF4,12)","v":"2026-12-31"},{"$f":"EOMONTH(AG4,12)","v":"2027-12-31"},{"$f":"EOMONTH(AH4,12)","v":"2028-12-31"},{"$f":"EOMONTH(AI4,12)","v":"2029-12-31"},{"$f":"EOMONTH(AJ4,12)","v":"2030-12-31"},{"$f":"EOMONTH(AK4,12)","v":"2031-12-31"},{"$f":"EOMONTH(AL4,12)","v":"2032-12-31"},{"$f":"EOMONTH(AM4,12)","v":"2033-12-31"}]
[null,"BK128425 Corp",{"$f":"IFERROR(YEAR(_xll.BDP(B5,\"DS035\")), 0)","v":2027},{"$f":"IFERROR(_xll.BDP(B5,\"DS033\")/100, 0)","v":8.1250000000000003E-2},{"$f":"IFERROR(_xll.BDP(B5,\"DS004\"), 0)","v":"USD"},{"$f":"IFERROR(_xll.BDP(B5,\"DS021\")/1000000, 0)","v":1610.8979999999999},{"$f":"IFERROR(_xll.BDP(B5,\"DS218\")/1000000, 0)","v":1800},{"$f":"IFERROR(IF(E5=Hub!$D$8,F5, F5*((_xll.BDP(E5 & Hub!$D$8 & \" Curncy\", \"PR005\")/_xll.BDP(E5 & Hub!$D$8 & \" Curncy\", \"DS672\")))),0)","v":1610.8979999999999},null,{"$f":"IFERROR(IF(C5=0,0,-PV(DCF!$D$12, C5-YEAR(DCF!$D$10), H5*D5, H5, 0)),\"\")","v":1973.4286557619039},null,null,null,null,null,null,null,null,null,null,null,null,null,null,"-5FY","-4FY","-3FY","-2FY","-1FY","-0FY"]
[null,"ZF564137 Corp",{"$f":"IFERROR(YEAR(_xll.BDP(B6,\"DS035\")), 0)","v":2032},{"$f":"IFERROR(_xll.BDP(B6,\"DS033\")/100, 0)","v":6.5000000000000002E-2},{"$f":"IFERROR(_xll.BDP(B6,\"DS004\"), 0)","v":"USD"},{"$f":"IFERROR(_xll.BDP(B6,\"DS021\")/1000000, 0)","v":1500},{"$f":"IFERROR(_xll.BDP(B6,\"DS218\")/1000000, 0)","v":1500},{"$f":"IFERROR(IF(E6=Hub!$D$8,F6, F6*((_xll.BDP(E6 & Hub!$D$8 & \" Curncy\", \"PR005\")/_xll.BDP(E6 & Hub!$D$8 & \" Curncy\", \"DS672\")))),0)","v":1500},null,{"$f":"IFERROR(IF(C6=0,0,-PV(DCF!$D$12, C6-YEAR(DCF!$D$10), H6*D6, H6, 0)),\"\")","v":2023.2668957195099},null,null,null,null,null,null,null,null,null,null,null,null,null,"Main Debt Schedule",null,null,null,null,null,null,null,null,null,null,null,null,null,null,null,null,null,{"$f":"AE3","v":2024},{"$f":"IF(COUNTBLANK(P4:P103)=100, IF(COUNTBLANK(D4:D103)=100, \"N/A\", SUMPRODUCT(D4:D103*H4:H103)/SUM(H4:H103)), SUMPRODUCT(P4:P103*R4:R103)/SUM(R4:R103))","v":6.7167218120147087E-2},{"$f":"AE12","v":{"$error":"#DIV/0!"}},{"$f":"IF(COUNTBLANK(O4:O103)=100, IF(COUNTBLANK(C4:C103)=100, \"N/A\", SUMPRODUCT(C4:C103*H4:H103)/SUM(H4:H103)), SUMPRODUCT(O4:O103*R4:R103)/SUM(R4:R103))-YEAR(AE4)","v":9}]
{"$rows_left_out":100}
{"sheet":"Comps--->","index":22,"n_rows":0,"n_cols":0,"rows_kept":0,"cut":false,"hidden":false,"merged":[]}

{"sheet":"Comp_Overview","index":23,"n_rows":106,"n_cols":15,"rows_kept":106,"cut":false,"hidden":false,"merged":[]}
[]
[null,null,null,"Competitors","Name","Share price","Market Cap","Enterprise Value","Revenue","EBITDA","Net Income","EV/EBITDA","EV/Sales","D/E","P/E"]
[]
[null,"Average",null,null,null,{"$f":"AVERAGE(F9:F1002)","v":54.467692307692303},{"$f":"AVERAGE(G9:G1002)","v":8548.8760784592305},{"$f":"AVERAGE(H9:H1002)","v":16983.430921854615},4509.0444615384613,1107.2355384615382,311.58795917777968,74.246879415958972,{"$f":"AVERAGE(M9:M1002)","v":3.2544111265311932},5.433245031743188,29.35042073285242]
[null,"Median",null,null,null,{"$f":"_xlfn.QUARTILE.INC(F9:F1002,2)","v":45.37},{"$f":"_xlfn.QUARTILE.INC(G9:G1002,2)","v":6229.1196610299994},{"$f":"_xlfn.QUARTILE.INC(H9:H1002,2)","v":12665.1},2902,698.59899999999993,201.26504,10.491307949580426,{"$f":"_xlfn.QUARTILE.INC(M9:M1002,2)","v":2.6164518757830484},4.1380400421496315,22.554732775273667]
[]
{"$rows_left_out":101}
{"sheet":"XLinkMeta","index":24,"n_rows":1,"n_cols":1,"rows_kept":1,"cut":false,"hidden":true,"merged":[]}
["_DM|LnkdItm|_bdm.ea3f447f8b5b4fffb0167a29dfb6d531.edm|_bdm.a4e6267072534357bb87a35dcb514114.edm"]